파폭 3.1b2 빌드하는데 에러가 있네요

SSL 관련해서 에러가 나는데요… libssl-dev 같은건 다 설치했습니다 .

PPA 저장소도 추가해서 3.1 의 build 의존성있는것도 다 설치했구요.

에러는

[code:36k9e2hu]virtual-dtor -Wcast-align -Wno-invalid-offsetof -Wno-long-long -pedantic -fno-strict-aliasing -fshort-wchar -pthread -pipe -DNDEBUG -DTRIMMED -Os -freorder-blocks -fno-reorder-functions -DMOZILLA_CLIENT -include ../../../../mozilla-config.h -Wp,-MD,.deps/nsNSSCertificate.pp nsNSSCertificate.cpp
nsNSSCertificate.cpp: In member function ‘virtual nsresult nsNSSCertificate::GetAllTokenNames(PRUint32*, PRUnichar***)’:
nsNSSCertificate.cpp:913: error: ‘PK11_GetAllSlotsForCert’ was not declared in this scope
make[6]: *** [nsNSSCertificate.o] 오류 1
make[6]: Leaving directory /home/hanbin973/firefox-3.1b2/security/manager/ssl/src' make[5]: *** [libs] 오류 2 make[5]: Leaving directory /home/hanbin973/firefox-3.1b2/security/manager/ssl’
make[4]: *** [libs] 오류 2
make[4]: Leaving directory /home/hanbin973/firefox-3.1b2/security/manager' make[3]: *** [libs_tier_toolkit] 오류 2 make[3]: Leaving directory /home/hanbin973/firefox-3.1b2’
make[2]: *** [tier_toolkit] 오류 2
make[2]: Leaving directory /home/hanbin973/firefox-3.1b2' make[1]: *** [default] 오류 2 make[1]: Leaving directory /home/hanbin973/firefox-3.1b2’
make: *** [build-stamp] 오류 2
[/code:36k9e2hu]

제가 PPA 에 있는거 쓰지않는 이유는 이유가 다 있어서입니다. 여가지로 제가 필요한 옵션들이 없더군요.

전에 IRC 에서 꼭 파이어폭스 컴파일 하고 싶어 하던 유저가 있었죠 …
그래서 그때 그친구와 대화 많이 했는데…

그친구가 하면서 남긴 글이…

viewtopic.php?p=13732#p13732 입니다.

한빈이는 무엇을 뻬먹엇을까요 ?

libcurl4-openssl-dev 이걸 빼먹었군요 ㅋㅋ;;

그런데 문제가 있습니다. 아래 해결좀 해주세요… 그리고 libcurl 는 재설치 불가, 삭제할경우 지워지는게 너무 많군요 ㅡㅡ;;

어떻게 하죠…