파이어폭스 4.0 b6 컴파일중에 문제가 생겼어요

3.6.10 은 잘되는데 4.0b6 은 안되네요;; 일반과정까지는 잘되느데 PGO 부터 문제가 생깁니다. 저번에 b3 때랑 같은 에러네요.

[code:3cz5gkb9]lude/glib-2.0 -I/usr/lib/glib-2.0/include -I/usr/include/pixman-1 -I/usr/include/freetype2 -I/usr/include/directfb -I/usr/include/libpng12 -I/usr/include/gtk-unix-print-2.0 -O2 -DMOZILLA_CLIENT -include ../../mozilla-config.h -MD -MF .deps/process_util_posix.pp /home/hanbin973/firefox-pgo-beta/mozilla-central/ipc/chromium/src/base/process_util_posix.cc
{standard input}: Assembler messages:
{standard input}:350: Error: .cfi_endproc without corresponding .cfi_startproc
{standard input}:370: Error: previous CFI entry not closed (missing .cfi_endproc)
{standard input}:498: Error: .cfi_endproc without corresponding .cfi_startproc
{standard input}:1002: Error: previous CFI entry not closed (missing .cfi_endproc)
{standard input}:1044: Error: .cfi_endproc without corresponding .cfi_startproc
{standard input}:1064: Error: previous CFI entry not closed (missing .cfi_endproc)
{standard input}:1193: Error: .cfi_endproc without corresponding .cfi_startproc
{standard input}:1217: Error: previous CFI entry not closed (missing .cfi_endproc)
{standard input}:1257: Error: .cfi_endproc without corresponding .cfi_startproc
{standard input}:1329: Error: previous CFI entry not closed (missing .cfi_endproc)
{standard input}:1379: Error: .cfi_endproc without corresponding .cfi_startproc
{standard input}:1502: Error: open CFI at the end of file; missing .cfi_endproc directive
make[6]: *** [message_pump_libevent.o] 오류 1
make[6]: *** 끝나지 않은 작업을 기다리고 있습니다....
/home/hanbin973/firefox-pgo-beta/mozilla-central/ipc/chromium/src/base/process_posix.cc: In function ‘int pthread_equal(pthread_t, pthread_t)’:
/home/hanbin973/firefox-pgo-beta/mozilla-central/ipc/chromium/src/base/process_posix.cc:70: note: file /home/hanbin973/firefox-pgo-beta/mozilla-central/ff-pgo/ipc/chromium/process_posix.gcda not found, execution counts estimated
/home/hanbin973/firefox-pgo-beta/mozilla-central/ipc/chromium/src/base/process_util_posix.cc: In function ‘int pthread_equal(pthread_t, pthread_t)’:
/home/hanbin973/firefox-pgo-beta/mozilla-central/ipc/chromium/src/base/process_util_posix.cc:541: note: file /home/hanbin973/firefox-pgo-beta/mozilla-central/ff-pgo/ipc/chromium/process_util_posix.gcda not found, execution counts estimated
make[6]: Leaving directory /home/hanbin973/firefox-pgo-beta/mozilla-central/ff-pgo/ipc/chromium' make[5]: *** [libs] 오류 2 make[5]: Leaving directory /home/hanbin973/firefox-pgo-beta/mozilla-central/ff-pgo/ipc’
make[4]: *** [libs_tier_platform] 오류 2
make[4]: Leaving directory /home/hanbin973/firefox-pgo-beta/mozilla-central/ff-pgo' make[3]: *** [tier_platform] 오류 2 make[3]: Leaving directory /home/hanbin973/firefox-pgo-beta/mozilla-central/ff-pgo’
make[2]: *** [default] 오류 2
make[2]: Leaving directory /home/hanbin973/firefox-pgo-beta/mozilla-central/ff-pgo' make[1]: *** [build] 오류 2 make[1]: Leaving directory /home/hanbin973/firefox-pgo-beta/mozilla-central’
make: *** [profiledbuild] 오류 2
hanbin973@hanbin973-desktop:~/firefox-pgo-beta/mozilla-central$
[/code:3cz5gkb9]

끝나지 않은 작업이라면 대체 무엇일까요? ( 빌드에 필요한 도구들은 모두 설치되어잇습니다. )

컴파일 실패하면 필요한 파일을 전부 다운받지 않았던지 컴파일 하는 툴 버전이 다르다던지 둘 중 하나겠죠.

3.7 까지는 ( 3.7 에서 4.0 으로 바꾼… ) 잘되었는데… 걍 10.10 에 가서 할렵니다. =.=;;

아직 끝나지 않는 작업이라… 뭘까요 =.=