Usb 무선 랜 설치 관련하여 도움을 구합니다

vm웨어 플레이어를 통해 구동 중입니다.

무선 랜카드는 iptime의 N600UA입니다.

칩셋은 RALINK의 2870을 사용하는 것 같습니다.

제가 해 본 방법으로는 iptime 홈페이지에서 해당 모델의 드라이버 다운 + 설치, wirelesslinux에서 해당 드라이버 다운 + 설치 해 보았는데 인식을 못 하는 것 같습니다.

마지막으로 RALINK 홈페이지에서 해당 드라이버를 받아서 설치 해 보고 있는데

make 하면

[code:33b2rdza]make -C tools
make[1]: Entering directory /root/2010_0709_RT2870_Linux_STA_v2.4.0.1/tools' gcc -g bin2h.c -o bin2h make[1]: Leaving directory /root/2010_0709_RT2870_Linux_STA_v2.4.0.1/tools’
/root/2010_0709_RT2870_Linux_STA_v2.4.0.1/tools/bin2h
cp -f os/linux/Makefile.6 /root/2010_0709_RT2870_Linux_STA_v2.4.0.1/os/linux/Makefile
make -C /lib/modules/3.2.6/build SUBDIRS=/root/2010_0709_RT2870_Linux_STA_v2.4.0.1/os/linux modules
make[1]: Entering directory /usr/src/linux-source-3.2.6' CC [M] /root/2010_0709_RT2870_Linux_STA_v2.4.0.1/os/linux/../../common/cmm_mac_usb.o /root/2010_0709_RT2870_Linux_STA_v2.4.0.1/os/linux/../../common/cmm_mac_usb.c: In function ‘RTMPAllocUsbBulkBufStruct’: /root/2010_0709_RT2870_Linux_STA_v2.4.0.1/os/linux/../../common/cmm_mac_usb.c:52: error: implicit declaration of function ‘usb_buffer_alloc’ /root/2010_0709_RT2870_Linux_STA_v2.4.0.1/os/linux/../../common/cmm_mac_usb.c:52: warning: assignment makes pointer from integer without a cast /root/2010_0709_RT2870_Linux_STA_v2.4.0.1/os/linux/../../common/cmm_mac_usb.c: In function ‘RTMPFreeUsbBulkBufStruct’: /root/2010_0709_RT2870_Linux_STA_v2.4.0.1/os/linux/../../common/cmm_mac_usb.c:78: error: implicit declaration of function ‘usb_buffer_free’ /root/2010_0709_RT2870_Linux_STA_v2.4.0.1/os/linux/../../common/cmm_mac_usb.c: In function ‘RTMPFreeTxRxRingMemory’: /root/2010_0709_RT2870_Linux_STA_v2.4.0.1/os/linux/../../common/cmm_mac_usb.c:234: warning: passing argument 3 of ‘RTMPFreeUsbBulkBufStruct’ from incompatible pointer type /root/2010_0709_RT2870_Linux_STA_v2.4.0.1/os/linux/../../common/cmm_mac_usb.c:62: note: expected ‘UCHAR **’ but argument is of type ‘struct __TX_BUFFER **’ /root/2010_0709_RT2870_Linux_STA_v2.4.0.1/os/linux/../../common/cmm_mac_usb.c:241: warning: passing argument 3 of ‘RTMPFreeUsbBulkBufStruct’ from incompatible pointer type /root/2010_0709_RT2870_Linux_STA_v2.4.0.1/os/linux/../../common/cmm_mac_usb.c:62: note: expected ‘UCHAR **’ but argument is of type ‘struct __TX_BUFFER **’ /root/2010_0709_RT2870_Linux_STA_v2.4.0.1/os/linux/../../common/cmm_mac_usb.c:278: warning: passing argument 3 of ‘RTMPFreeUsbBulkBufStruct’ from incompatible pointer type /root/2010_0709_RT2870_Linux_STA_v2.4.0.1/os/linux/../../common/cmm_mac_usb.c:62: note: expected ‘UCHAR **’ but argument is of type ‘struct __HTTX_BUFFER **’ /root/2010_0709_RT2870_Linux_STA_v2.4.0.1/os/linux/../../common/cmm_mac_usb.c: In function ‘NICInitTransmit’: /root/2010_0709_RT2870_Linux_STA_v2.4.0.1/os/linux/../../common/cmm_mac_usb.c:507: warning: passing argument 3 of ‘RTMPFreeUsbBulkBufStruct’ from incompatible pointer type /root/2010_0709_RT2870_Linux_STA_v2.4.0.1/os/linux/../../common/cmm_mac_usb.c:62: note: expected ‘UCHAR **’ but argument is of type ‘struct __TX_BUFFER **’ /root/2010_0709_RT2870_Linux_STA_v2.4.0.1/os/linux/../../common/cmm_mac_usb.c: In function ‘RTMPAllocTxRxRingMemory’: /root/2010_0709_RT2870_Linux_STA_v2.4.0.1/os/linux/../../common/cmm_mac_usb.c:566: warning: passing argument 3 of ‘RTMPAllocUsbBulkBufStruct’ from incompatible pointer type /root/2010_0709_RT2870_Linux_STA_v2.4.0.1/os/linux/../../common/cmm_mac_usb.c:34: note: expected ‘VOID **’ but argument is of type ‘struct __HTTX_BUFFER **’ /root/2010_0709_RT2870_Linux_STA_v2.4.0.1/os/linux/../../common/cmm_mac_usb.c:596: warning: passing argument 3 of ‘RTMPAllocUsbBulkBufStruct’ from incompatible pointer type /root/2010_0709_RT2870_Linux_STA_v2.4.0.1/os/linux/../../common/cmm_mac_usb.c:34: note: expected ‘VOID **’ but argument is of type ‘struct __TX_BUFFER **’ /root/2010_0709_RT2870_Linux_STA_v2.4.0.1/os/linux/../../common/cmm_mac_usb.c:610: warning: passing argument 3 of ‘RTMPAllocUsbBulkBufStruct’ from incompatible pointer type /root/2010_0709_RT2870_Linux_STA_v2.4.0.1/os/linux/../../common/cmm_mac_usb.c:34: note: expected ‘VOID **’ but argument is of type ‘struct __TX_BUFFER **’ /root/2010_0709_RT2870_Linux_STA_v2.4.0.1/os/linux/../../common/cmm_mac_usb.c:628: warning: passing argument 3 of ‘RTMPAllocUsbBulkBufStruct’ from incompatible pointer type /root/2010_0709_RT2870_Linux_STA_v2.4.0.1/os/linux/../../common/cmm_mac_usb.c:34: note: expected ‘VOID **’ but argument is of type ‘UCHAR **’ make[2]: *** [/root/2010_0709_RT2870_Linux_STA_v2.4.0.1/os/linux/../../common/cmm_mac_usb.o] Error 1 make[1]: *** [_module_/root/2010_0709_RT2870_Linux_STA_v2.4.0.1/os/linux] Error 2 make[1]: Leaving directory /usr/src/linux-source-3.2.6’
make: *** [LINUX] Error 2
[/code:33b2rdza]

에러 두 개가 보이는군요…

아 그리고 vm웨어의 오른쪽 상단에는 usb에 ralink 802.11n 인식 되었다고 나옵니다.

제가 뭔가 잘못하고 있는 것 같은데…

도움을 주시면 감사하겠습니다.
꾸벅